error: jump to case label

问题描述: 代码: int main() {    int a =0;    switch(a)    {        case 0: int b = 0;break;        case 1: break;        default:break;    }  ...

Error running ‘requirements_osx_brew_update_system ‘

问题描述: Error running ‘requirements_osx_brew_update_system ‘ macbook安装ruby报错: MacBook-Pro-2:~ suyuhang$ rvm requirements Checking requirements for osx. Error: No available formula for gcc46 Installing requirements f...

HTTP Error 500.23

问题描述: This error 500.23 translates to – An ASP.NET httpHandlers configuration does not apply in Managed Pipeline mode. 解决方法: Check the httpHandlers configuration in IIS. Try following: 1. Open Server Manager 2. Select Roles>Web Server (IIS)>II...

error C2061: 语法错误 : 标识符“CDWordArray”

问题描述: 当希望用数组类,而又不想用MFC的数组类,就用了ATL的数据类CAtlArray, 但是ATL中没有定义类CDWordArray,所以此时如果利用了CDWordArray就会报下面的错误: error C2061: 语法错误 : 标识符“CDWordArray” 解决方法: 自定义一个CDWordArray: typedef CAtlArray <DWO...

error C3861: “time”: 找不到标识符

问题描述: srand((unsigned)time(0)); 编译上面的代码报错 error C3861: “time”: 找不到标识符 解决方法: #include <time.h>

error LNK2001: unresolved external symbol __imp__SetupDiGetDeviceInterfaceDetailA@24

问题描述: error   LNK2001:   unresolved   external   symbol   __imp__SetupDiGetDeviceInterfaceDetailA@24 解决方法: 加入lib库的引用 #pragma comment(lib,”Setupapi.lib”)

fatal error C1083: Cannot open include file: ‘wdm.h': No such file or directory

问题描述: fatal error C1083: Cannot open include file: ‘wdm.h': No such file or directory 解决方法: VC6.0 Tools – Options – Directoies – Show directories for – Include files 修改include目录时,加入DDK目录,比如: D:/WINDDK/3790.183...

error C2065: “SC_HANDLE” : 未声明的标识符

问题描述: error C2146: 语法错误 : 缺少“;”(在标识符“hServStatus”的前面) error C2501: “hServStatus” : 缺少存储类或类型说明符 error C2146: 语法错误 : 缺少“;”(在标识符“hSStat”的前面) error C2501: “hSStat” : 缺少存储类或类型说明符 error C2065: “SERVICE_TABLE_ENTRY” : 未声明...

error: failed to attach to process ID

问题描述: error: failed to attach to process ID 解决方法: Open only XCode without opening project -> Go to Window -> Organizer -> [ProjectName] and delete it completely -> Quit XCode -> Open iPhone simulator and reset settings -> Quit iPhone s...

Installation error: INSTALL_FAILED_SHARED_USER_INCOMPATIBLE

问题描述: 在windows平台通过eclipse编译android源码中,如果编译Settings或者android manifest XML中 shared user id 包含android.uid.shared等系统权限的时候,则会报以下错误。 Installation error: INSTALL_FAILED_UPDATE_INCOMPATIBLE Installation error: INSTALL_FAILED_SHARED_USER_...